Target
Multidrug resistance-associated protein 1
Ligand
BDBM50013920
Substrate
Meas. Tech.
ChEMBL_800770 (CHEMBL1948106)
IC50
2800±n/a nM
Citation
 Pellicani, RZStefanachi, ANiso, MCarotti, ALeonetti, FNicolotti, OPerrone, RBerardi, FCellamare, SColabufo, NA Potent galloyl-based selective modulators targeting multidrug resistance associated protein 1 and P-glycoprotein. J Med Chem 55:424-36 (2012)  
Target
Name:
Multidrug resistance-associated protein 1
Synonyms:
7.6.2.2 ABCC1 ATP-binding cassette, sub-family C, member 1 isoform 1 LTC4 transporter MRP MRP1_HUMAN
Type:
Mol. Mass.:
171597.72
Organism:
Homo sapiens (Human)
Description:
P33527
Residue:
1531
  
Inhibitor
Name:
BDBM50013920
Synonyms:
3-[(R)-{3-[(E)-2-(7-Chloro-quinolin-2-yl)-vinyl]-phenyl}-(2-dimethylcarbamoyl-ethylsulfanyl)-methylsulfanyl]-propionic acid CHEMBL280481 VERLUKAST
Type:
Small organic molecule
Emp. Form.:
C26H27ClN2O3S2
Mol. Mass.:
515.087
SMILES:
CN(C)C(=O)CCS[C@H](SCCC(O)=O)c1cccc(\C=C\c2ccc3ccc(Cl)cc3n2)c1
: