Target
Low molecular weight protein-tyrosine phosphatase A
Ligand
BDBM50363157
Substrate
Meas. Tech.
ChEMBL_801151 (CHEMBL1948978)
Ki
12000±n/a nM
Citation
 Chiaradia, LDMartins, PGCordeiro, MNGuido, RVEcco, GAndricopulo, ADYunes, RAVernal, JNunes, RJTerenzi, H Synthesis, biological evaluation, and molecular modeling of chalcone derivatives as potent inhibitors of Mycobacterium tuberculosis protein tyrosine phosphatases (PtpA and PtpB). J Med Chem 55:390-402 (2012)  
Target
Name:
Low molecular weight protein-tyrosine phosphatase A
Synonyms:
PTPA_MYCTU Probable low molecular weight protein-tyrosine-phosphatase mptpA | ptpA
Type:
Hydrolase
Mol. Mass.:
17891.84
Organism:
Mycobacterium tuberculosis
Description:
Residue:
163
  
Inhibitor
Name:
BDBM50363157
Synonyms:
CHEMBL1945186
Type:
Small organic molecule
Emp. Form.:
C25H24O5
Mol. Mass.:
404.4551
SMILES:
COc1ccc(C(=O)\C=C\c2ccc(OCc3ccccc3)c(OC)c2)c(OC)c1
: