Target
Hepatocyte growth factor receptor
Ligand
BDBM50363167
Substrate
Meas. Tech.
ChEMBL_801296 (CHEMBL1947845)
IC50
>10000±n/a nM
Citation
 Huber, KBrault, LFedorov, OGasser, CFilippakopoulos, PBullock, ANFabbro, DTrappe, JSchwaller, JKnapp, SBracher, F 7,8-dichloro-1-oxo-ß-carbolines as a versatile scaffold for the development of potent and selective kinase inhibitors with unusual binding modes. J Med Chem 55:403-13 (2012)  
Target
Name:
Hepatocyte growth factor receptor
Synonyms:
Hepatocyte growth factor receptor Hepatocyte growth factor receptor (c-MET) MET Met proto-oncogene (hepatocyte growth factor receptor) Tyrosine-protein kinase Met (c-Met) c-Met kinase
Type:
Protein
Mol. Mass.:
155559.73
Organism:
Homo sapiens (Human)
Description:
P08581
Residue:
1390
  
Inhibitor
Name:
BDBM50363167
Synonyms:
CHEMBL1945559
Type:
Small organic molecule
Emp. Form.:
C17H16Cl2N4O
Mol. Mass.:
363.241
SMILES:
Cn1c2c(C(C#N)C3(CCNCC3)NC2=O)c2ccc(Cl)c(Cl)c12
: