Target
Serine/threonine-protein kinase PLK1
Ligand
BDBM50363167
Substrate
Meas. Tech.
ChEMBL_801314 (CHEMBL1947863)
IC50
>10000±n/a nM
Citation
 Huber, KBrault, LFedorov, OGasser, CFilippakopoulos, PBullock, ANFabbro, DTrappe, JSchwaller, JKnapp, SBracher, F 7,8-dichloro-1-oxo-ß-carbolines as a versatile scaffold for the development of potent and selective kinase inhibitors with unusual binding modes. J Med Chem 55:403-13 (2012)  
Target
Name:
Serine/threonine-protein kinase PLK1
Synonyms:
PLK PLK1 Polo-like kinase 1 (PlK1) STPK13 Serine/threonine-protein kinase 13 | polo-like kinase
Type:
Serine/threonine-protein kinase
Mol. Mass.:
68277.16
Organism:
Homo sapiens (Human)
Description:
P53350
Residue:
603
  
Inhibitor
Name:
BDBM50363167
Synonyms:
CHEMBL1945559
Type:
Small organic molecule
Emp. Form.:
C17H16Cl2N4O
Mol. Mass.:
363.241
SMILES:
Cn1c2c(C(C#N)C3(CCNCC3)NC2=O)c2ccc(Cl)c(Cl)c12
: