Target
Nitric oxide synthase, brain
Ligand
BDBM50363262
Substrate
Meas. Tech.
ChEMBL_800847 (CHEMBL1948399)
IC50
12±n/a nM
Citation
 Durón, SGLindstrom, ABonnefous, CZhang, HChen, XSymons, KTSablad, MRozenkrants, NZhang, YWang, LYazdani, NShiau, AKNoble, SARix, PRao, TSHassig, CASmith, ND Heteroaromatic-aminomethyl quinolones: potent and selective iNOS inhibitors. Bioorg Med Chem Lett 22:1237-41 (2012)  
Target
Name:
Nitric oxide synthase, brain
Synonyms:
Constitutive NOS NC-NOS NOS type I nNOS NOS1_HUMAN Neuronal nitric oxide synthase Nitric oxide synthase, neuronal (nNOS) bNOS | nNOS
Type:
Homodimer
Mol. Mass.:
160985.98
Organism:
Homo sapiens (Human)
Description:
P29475
Residue:
1434
  
Inhibitor
Name:
BDBM50363262
Synonyms:
CHEMBL1944717
Type:
Small organic molecule
Emp. Form.:
C20H13ClF2N4O
Mol. Mass.:
398.793
SMILES:
Fc1ccc2c(CN(c3cccc(Cl)c3)c3cnccn3)cc(=O)[nH]c2c1F
: