Target
Nitric oxide synthase, inducible
Ligand
BDBM50363275
Substrate
Meas. Tech.
ChEMBL_800845 (CHEMBL1948397)
IC50
1300±n/a nM
Citation
 Durón, SGLindstrom, ABonnefous, CZhang, HChen, XSymons, KTSablad, MRozenkrants, NZhang, YWang, LYazdani, NShiau, AKNoble, SARix, PRao, TSHassig, CASmith, ND Heteroaromatic-aminomethyl quinolones: potent and selective iNOS inhibitors. Bioorg Med Chem Lett 22:1237-41 (2012)  
Target
Name:
Nitric oxide synthase, inducible
Synonyms:
HEP-NOS Inducible NO synthase NOS type II NOS2A Nitric oxide synthase, inducible (iNOS) | iNOS
Type:
Homodimer
Mol. Mass.:
131141.95
Organism:
Homo sapiens (Human)
Description:
P35228
Residue:
1153
  
Inhibitor
Name:
BDBM50363275
Synonyms:
CHEMBL1944889
Type:
Small organic molecule
Emp. Form.:
C22H18ClF2N5O
Mol. Mass.:
441.861
SMILES:
CN(C)c1nccc(n1)N(Cc1cc(=O)[nH]c2c(F)c(F)ccc12)c1cccc(Cl)c1
: