Target
5-hydroxytryptamine receptor 3A
Ligand
BDBM50363291
Substrate
Meas. Tech.
ChEMBL_800919 (CHEMBL1948646)
Ki
1.2±n/a nM
Citation
 Simonin, JVernekar, SKThompson, AJHothersall, JDConnolly, CNLummis, SCLochner, M High-affinity fluorescent ligands for the 5-HT(3) receptor. Bioorg Med Chem Lett 22:1151-5 (2012)  
Target
Name:
5-hydroxytryptamine receptor 3A
Synonyms:
5-HT-3 5-HT3A 5-hydroxytryptamine receptor 3 (5-HT3) 5-hydroxytryptamine receptor 3A (5HT3A) 5HT3R HTR3A Serotonin 3 receptor (5HT3) Serotonin-gated ion channel receptor | Serotonin-gated ion channel receptor 3
Type:
Protein
Mol. Mass.:
55283.27
Organism:
Homo sapiens (Human)
Description:
P46098
Residue:
478
  
Inhibitor
Name:
BDBM50363291
Synonyms:
CHEMBL1945835
Type:
Small organic molecule
Emp. Form.:
C32H40N6O3S
Mol. Mass.:
588.763
SMILES:
CN(C)c1cccc2c(cccc12)S(=O)(=O)NCCCn1nc(C(=O)NC2C[C@@H]3CCC[C@@H](C2)N3C)c2ccccc12
: