Target
Serine/threonine-protein kinase B-raf
Ligand
BDBM25391
Substrate
Meas. Tech.
ChEMBL_801453 (CHEMBL1948275)
EC50
1100±n/a nM
Citation
 Zambon, ANiculescu-Duvaz, INiculescu-Duvaz, DMarais, RSpringer, CJ Small molecule inhibitors of BRAF in clinical trials. Bioorg Med Chem Lett 22:789-92 (2012)  
Target
Name:
Serine/threonine-protein kinase B-raf
Synonyms:
B-RAF B-Raf proto-oncogene serine/threonine-protein kinase BRAF1 RAFB1 v-Raf murine sarcoma viral oncogene homolog B1
Type:
Serine/threonine-protein kinase
Mol. Mass.:
84446.00
Organism:
Homo sapiens (Human)
Description:
P15056
Residue:
766
  
Inhibitor
Name:
BDBM25391
Synonyms:
CHEMBL200622 SB590885 | [2-(4-{4-[(1E)-1-(hydroxyimino)-2,3-dihydro-1H-inden-5-yl]-5-(pyridin-4-yl)-1H-imidazol-2-yl}phenoxy)ethyl]dimethylamine
Type:
Small organic molecule
Emp. Form.:
C27H27N5O2
Mol. Mass.:
453.5356
SMILES:
CN(C)CCOc1ccc(cc1)-c1nc(c([nH]1)-c1ccc2C(CCc2c1)N=O)-c1ccncc1
: