Target
Mitogen-activated protein kinase 8
Ligand
BDBM50363467
Substrate
Meas. Tech.
ChEMBL_800184 (CHEMBL1947746)
IC50
270±n/a nM
Citation
 Krenitsky, VPDelgado, MNadolny, LSahasrabudhe, KAyala, LClareen, SSHilgraf, RAlbers, RKois, AHughes, KWright, JNowakowski, JSudbeck, EGhosh, SBahmanyar, SChamberlain, PMuir, JCathers, BEGiegel, DXu, LCeleridad, MMoghaddam, MKhatsenko, OOmholt, PKatz, JPai, SFan, RTang, YShirley, MABenish, BBlease, KRaymon, HBhagwat, SHenderson, ICole, AGBennett, BSatoh, Y Aminopurine based JNK inhibitors for the prevention of ischemia reperfusion injury. Bioorg Med Chem Lett 22:1427-32 (2012)  
Target
Name:
Mitogen-activated protein kinase 8
Synonyms:
JNK-46 JNK1-alpha-1 MK08_HUMAN PRKM8 SAPK1C c-Jun N-terminal kinase 1 c-Jun N-terminal kinase 1(JNK1) | c-Jun N-terminal kinase 2 (JNK2)
Type:
Enzyme
Mol. Mass.:
48297.57
Organism:
Homo sapiens (Human)
Description:
JNK-1 was purchased from Upstate Cell Signaling Solutions (formerly Upstate Biotechnology).
Residue:
427
  
Inhibitor
Name:
BDBM50363467
Synonyms:
CHEMBL1946837
Type:
Small organic molecule
Emp. Form.:
C22H27F2N7
Mol. Mass.:
427.4935
SMILES:
N[C@H]1CC[C@@H](CC1)Nc1ncc2nc(Nc3ccc(F)cc3F)n(C3CCCC3)c2n1
: