Target
Mitogen-activated protein kinase 9
Ligand
BDBM50363465
Substrate
Meas. Tech.
ChEMBL_800185 (CHEMBL1947747)
IC50
9±n/a nM
Citation
 Krenitsky, VPDelgado, MNadolny, LSahasrabudhe, KAyala, LClareen, SSHilgraf, RAlbers, RKois, AHughes, KWright, JNowakowski, JSudbeck, EGhosh, SBahmanyar, SChamberlain, PMuir, JCathers, BEGiegel, DXu, LCeleridad, MMoghaddam, MKhatsenko, OOmholt, PKatz, JPai, SFan, RTang, YShirley, MABenish, BBlease, KRaymon, HBhagwat, SHenderson, ICole, AGBennett, BSatoh, Y Aminopurine based JNK inhibitors for the prevention of ischemia reperfusion injury. Bioorg Med Chem Lett 22:1427-32 (2012)  
Target
Name:
Mitogen-activated protein kinase 9
Synonyms:
JNK-55 JNK2/JNK3 MK09_HUMAN Mitogen-activated protein kinase 8/9 SAPK1A c-Jun N-terminal kinase 2 | c-Jun N-terminal kinase 2 (JNK2)
Type:
Enzyme
Mol. Mass.:
48131.49
Organism:
Homo sapiens (Human)
Description:
JNK-2 was purchased from Upstate Cell Signaling Solutions (formerly Upstate Biotechnology).
Residue:
424
  
Inhibitor
Name:
BDBM50363465
Synonyms:
CHEMBL1946646
Type:
Small organic molecule
Emp. Form.:
C22H27F2N7
Mol. Mass.:
427.4935
SMILES:
N[C@H]1CC[C@@H](CC1)Nc1ncc2nc(Nc3c(F)cccc3F)n(C3CCCC3)c2n1
: