Target
Carbonic anhydrase 2
Ligand
BDBM12414
Substrate
Meas. Tech.
ChEMBL_801483 (CHEMBL1948410)
Ki
430±n/a nM
Citation
 Balaydin, HTSentürk, MMenzek, A Synthesis and carbonic anhydrase inhibitory properties of novel cyclohexanonyl bromophenol derivatives. Bioorg Med Chem Lett 22:1352-7 (2012)  
Target
Name:
Carbonic anhydrase 2
Synonyms:
CA-II CAC Carbonate dehydratase II Carbonic anhydrase 2 (CA-II) Carbonic anhydrase C Carbonic anhydrase II (CA-II) Carbonic anhydrase II (hCA II) | Carbonic anhydrase isoenzyme II (hCA II)
Type:
Enzyme
Mol. Mass.:
29250.71
Organism:
Homo sapiens (Human)
Description:
P00918
Residue:
260
  
Inhibitor
Name:
BDBM12414
Synonyms:
CHEMBL27601 hCA inhibitor, 6
Type:
Small organic molecule
Emp. Form.:
C6H7NO2S
Mol. Mass.:
157.19
SMILES:
NS(=O)(=O)c1ccccc1
: