Target
Carbonic anhydrase 4
Ligand
BDBM50134329
Substrate
Meas. Tech.
ChEMBL_801534 (CHEMBL1948548)
Ki
1040±n/a nM
Citation
 Ekinci, DCavdar, HDurdagi, STalaz, OSentürk, MSupuran, CT Structure-activity relationships for the interaction of 5,10-dihydroindeno[1,2-b]indole derivatives with human and bovine carbonic anhydrase isoforms I, II, III, IV and VI. Eur J Med Chem 49:68-73 (2012)  
Target
Name:
Carbonic anhydrase 4
Synonyms:
CA-IV CAH4_HUMAN Carbonic anhydrase Carbonic anhydrase IV (CA IV)
Type:
Enzyme
Mol. Mass.:
35037.98
Organism:
Homo sapiens (Human)
Description:
P22748
Residue:
312
  
Inhibitor
Name:
BDBM50134329
Synonyms:
CHEMBL122708 Sulfamic acid (8R,9S,13S,14S)-13-methyl-17-oxo-7,8,9,11,12,13,14,15,16,17-decahydro-6H-cyclopenta[a]phenanthren-3-yl ester estrone3-O-sulfamate
Type:
Small organic molecule
Emp. Form.:
C18H23NO4S
Mol. Mass.:
349.445
SMILES:
C[C@]12CC[C@H]3[C@@H](CCc4cc(OS(N)(=O)=O)ccc34)[C@@H]1CCC2=O
: