Target
Carbonic anhydrase 3
Ligand
BDBM50363552
Substrate
Meas. Tech.
ChEMBL_801536 (CHEMBL1948550)
Ki
15840±n/a nM
Citation
 Ekinci, DCavdar, HDurdagi, STalaz, OSentürk, MSupuran, CT Structure-activity relationships for the interaction of 5,10-dihydroindeno[1,2-b]indole derivatives with human and bovine carbonic anhydrase isoforms I, II, III, IV and VI. Eur J Med Chem 49:68-73 (2012)  
Target
Name:
Carbonic anhydrase 3
Synonyms:
CA-III CAH3_BOVIN Carbonic anhydrase 3 Carbonic anhydrase III
Type:
Enzyme
Mol. Mass.:
29376.92
Organism:
Bos taurus (Cattle)
Description:
Q3SZX4
Residue:
260
  
Inhibitor
Name:
BDBM50363552
Synonyms:
CHEMBL611502
Type:
Small organic molecule
Emp. Form.:
C17H15NO2
Mol. Mass.:
265.3065
SMILES:
COc1cc2Cc3c([nH]c4ccccc34)-c2cc1OC
: