Target
Nitric oxide synthase, endothelial
Ligand
BDBM50240895
Substrate
Meas. Tech.
ChEMBL_801785 (CHEMBL1947348)
Ki
>5000000±n/a nM
Citation
 Salerno, LModica, MNRomeo, GPittalà, VSiracusa, MAAmato, MEAcquaviva, RDi Giacomo, CSorrenti, V Novel inhibitors of nitric oxide synthase with antioxidant properties. Eur J Med Chem 49:118-26 (2012)  
Target
Name:
Nitric oxide synthase, endothelial
Synonyms:
Ecnos Nitric-oxide synthase, endothelial | Nos3
Type:
PROTEIN
Mol. Mass.:
132922.33
Organism:
Mus musculus
Description:
ChEMBL_801785
Residue:
1202
  
Inhibitor
Name:
BDBM50240895
Synonyms:
2-(1H-Imidazol-1-yl)-1-(4-nitrophenyl)ethanone CHEMBL162549
Type:
Small organic molecule
Emp. Form.:
C11H9N3O3
Mol. Mass.:
231.2075
SMILES:
[O-][N+](=O)c1ccc(cc1)C(=O)Cn1ccnc1
: