Target
Nitric oxide synthase, brain
Ligand
BDBM50363619
Substrate
Meas. Tech.
ChEMBL_801784 (CHEMBL1947347)
Ki
32500±n/a nM
Citation
 Salerno, LModica, MNRomeo, GPittalà, VSiracusa, MAAmato, MEAcquaviva, RDi Giacomo, CSorrenti, V Novel inhibitors of nitric oxide synthase with antioxidant properties. Eur J Med Chem 49:118-26 (2012)  
Target
Name:
Nitric oxide synthase, brain
Synonyms:
Bnos NC-NOS NOS type I nNOS Neuronal nitric oxide synthase Nitric Oxide Synthase, brain Nitric oxide synthase, brain (nNOS) Nitric-oxide synthase, brain (nNOS) Nos1 | Peptidyl-cysteine S-nitrosylase NOS1
Type:
Enzyme
Mol. Mass.:
160570.98
Organism:
Rattus norvegicus (rat)
Description:
Recombinant nNOS overexpressed in E. coli was used in enzyme assays.
Residue:
1429
  
Inhibitor
Name:
BDBM50363619
Synonyms:
CHEMBL1946357
Type:
Small organic molecule
Emp. Form.:
C15H11N3O3
Mol. Mass.:
281.2661
SMILES:
[O-][N+](=O)c1ccc(cc1)C(=O)Cn1cc2ccccc2n1
: