Target
Sodium-dependent noradrenaline transporter
Ligand
BDBM50296782
Substrate
Meas. Tech.
ChEMBL_801861 (CHEMBL1947473)
Ki
>500±n/a nM
Citation
 Mavel, SMincheva, ZMéheux, NCarcenac, YGuilloteau, DAbarbri, MEmond, P QSAR study and synthesis of new phenyltropanes as ligands of the dopamine transporter (DAT). Bioorg Med Chem 20:1388-95 (2012)  
Target
Name:
Sodium-dependent noradrenaline transporter
Synonyms:
Monoamine transporter NET Noradrenaline Transporter (NET) Norepinephrine transporter protein (NET) SLC6A2 Sodium-dependent noradrenaline transporter (NET) | Solute carrier family 6 member 2
Type:
Multi-pass membrane protein
Mol. Mass.:
69337.72
Organism:
Homo sapiens (Human)
Description:
P23975
Residue:
617
  
Inhibitor
Name:
BDBM50296782
Synonyms:
(1R,2S,3S,5S)-methyl 8-((E)-3-iodoallyl)-3-p-tolyl-8-azabicyclo[3.2.1]octane-2-carboxylate PE2I
Type:
Small organic molecule
Emp. Form.:
C19H24INO2
Mol. Mass.:
425.3038
SMILES:
COC(=O)[C@@H]1[C@H]2CC[C@@H](C[C@@H]1c1ccc(C)cc1)N2C\C=C\I
: