Target
Type-1 angiotensin II receptor
Ligand
BDBM50363830
Substrate
Meas. Tech.
ChEMBL_802198 (CHEMBL1949356)
IC50
30.8±n/a nM
Citation
 Wang, JLZhang, JZhou, ZMLi, ZHXue, WZXu, DHao, LPHan, XFFei, FLiu, TLiang, AH Design, synthesis and biological evaluation of 6-substituted aminocarbonyl benzimidazole derivatives as nonpeptidic angiotensin II AT1 receptor antagonists. Eur J Med Chem 49:183-90 (2012)  
Target
Name:
Type-1 angiotensin II receptor
Synonyms:
AGTR1 AGTR1B AT1 AT1BR AT2R1B Angiotensin II receptor Type-1 angiotensin II receptor (AT1)
Type:
Protein
Mol. Mass.:
41080.75
Organism:
Homo sapiens (Human)
Description:
P30556
Residue:
359
  
Inhibitor
Name:
BDBM50363830
Synonyms:
CHEMBL1945007
Type:
Small organic molecule
Emp. Form.:
C35H35N3O4
Mol. Mass.:
561.6701
SMILES:
CCCc1nc2c(C)cc(cc2n1Cc1ccc(cc1)-c1ccccc1C(O)=O)C(=O)NCCc1cccc(OC)c1
: