Target
Tyrosine-protein phosphatase non-receptor type 9
Ligand
BDBM50363861
Substrate
Meas. Tech.
ChEMBL_802235 (CHEMBL1949393)
IC50
>10000000±n/a nM
Citation
 Wang, QZhu, MZhu, RLu, LYuan, CXing, SFu, XMei, YHang, Q Exploration ofa-aminophosphonate N-derivatives as novel, potent and selective inhibitors of protein tyrosine phosphatases. Eur J Med Chem 49:354-64 (2012)  
Target
Name:
Tyrosine-protein phosphatase non-receptor type 9
Synonyms:
3.1.3.48 PTP-MEG2 PTPase MEG2 Protein-tyrosine phosphatase MEG2 (PTP-Meg2) | Tyrosine-protein phosphatase non-receptor type 9
Type:
Mol. Mass.:
68030.33
Organism:
Homo sapiens (Human)
Description:
P43378
Residue:
593
  
Inhibitor
Name:
BDBM50363861
Synonyms:
CHEMBL1946252
Type:
Small organic molecule
Emp. Form.:
C18H21NO6P
Mol. Mass.:
378.3368
SMILES:
CCOP(O)(=O)C(N[C@@H](Cc1ccccc1)C([O-])=O)c1ccccc1O
: