Target
Glycogen phosphorylase, muscle form
Ligand
BDBM50363876
Substrate
Meas. Tech.
ChEMBL_802298 (CHEMBL1949456)
pH
6.8±n/a
Ki
3700±n/a nM
Comments
extracted
Citation
 Nagy, VFelföldi, NKónya, BPraly, JPDocsa, TGergely, PChrysina, EDTiraidis, CKosmopoulou, MNAlexacou, KMKonstantakaki, MLeonidas, DDZographos, SEOikonomakos, NGKozmon, STvaroška, ISomsák, L N-(4-Substituted-benzoyl)-N'-(ß-d-glucopyranosyl)ureas as inhibitors of glycogen phosphorylase: Synthesis and evaluation by kinetic, crystallographic, and molecular modelling methods. Bioorg Med Chem 20:1801-16 (2012)  
Target
Name:
Glycogen phosphorylase, muscle form
Synonyms:
Glycogen Phosphorylase (PYGM) Glycogen phosphorylase, muscle form PYGM | PYGM_RABIT
Type:
Enzyme
Mol. Mass.:
97296.32
Organism:
Oryctolagus cuniculus (rabbit)
Description:
Phosphorylation of Ser-15 converts phosphorylase B (unphosphorylated) to phosphorylase A.
Residue:
843
  
Inhibitor
Name:
BDBM50363876
Synonyms:
CHEMBL1232637
Type:
Small organic molecule
Emp. Form.:
C20H22N2O7
Mol. Mass.:
402.3979
SMILES:
OC[C@H]1O[C@@H](NC(=O)NC(=O)c2ccc(cc2)-c2ccccc2)[C@H](O)[C@@H](O)[C@@H]1O
: