Target
Glycogen phosphorylase, muscle form
Ligand
BDBM50295844
Substrate
Meas. Tech.
ChEMBL_802298 (CHEMBL1949456)
pH
6.8±n/a
Ki
3300±n/a nM
Comments
extracted
Citation
 Nagy, VFelföldi, NKónya, BPraly, JPDocsa, TGergely, PChrysina, EDTiraidis, CKosmopoulou, MNAlexacou, KMKonstantakaki, MLeonidas, DDZographos, SEOikonomakos, NGKozmon, STvaroška, ISomsák, L N-(4-Substituted-benzoyl)-N'-(ß-d-glucopyranosyl)ureas as inhibitors of glycogen phosphorylase: Synthesis and evaluation by kinetic, crystallographic, and molecular modelling methods. Bioorg Med Chem 20:1801-16 (2012)  
Target
Name:
Glycogen phosphorylase, muscle form
Synonyms:
Glycogen Phosphorylase (PYGM) Glycogen phosphorylase, muscle form PYGM | PYGM_RABIT
Type:
Enzyme
Mol. Mass.:
97296.32
Organism:
Oryctolagus cuniculus (rabbit)
Description:
Phosphorylation of Ser-15 converts phosphorylase B (unphosphorylated) to phosphorylase A.
Residue:
843
  
Inhibitor
Name:
BDBM50295844
Synonyms:
4-nitro-N-((2R,3R,4S,5S,6R)-3,4,5-trihydroxy-6-(hydroxymethyl)tetrahydro-2H-pyran-2-ylcarbamoyl)benzamide N-{[(4-nitrophenyl)carbonyl]carbamoyl}-beta-D-glucopyranosylamine
Type:
Small organic molecule
Emp. Form.:
C14H17N3O9
Mol. Mass.:
371.2995
SMILES:
OC[C@H]1O[C@@H](NC(=O)NC(=O)c2ccc(cc2)[N+]([O-])=O)[C@H](O)[C@@H](O)[C@@H]1O
: