Target
D(2) dopamine receptor
Ligand
BDBM50363902
Substrate
Meas. Tech.
ChEMBL_802311 (CHEMBL1949469)
Ki
33±n/a nM
Citation
 Peprah, KZhu, XYEyunni, SVEtukala, JRSetola, VRoth, BLAblordeppey, SY Structure-activity relationship studies of SYA 013, a homopiperazine analog of haloperidol. Bioorg Med Chem 20:1671-8 (2012)  
Target
Name:
D(2) dopamine receptor
Synonyms:
D(2) dopamine receptor DOPAMINE D2 Long DRD2 Dopamine D2 receptor Dopamine D2 receptor (D2R) Dopamine2-like | d2
Type:
Cell-surface receptors
Mol. Mass.:
50647.10
Organism:
Homo sapiens (Human)
Description:
P14416
Residue:
443
  
Inhibitor
Name:
BDBM50363902
Synonyms:
CHEMBL1946123
Type:
Small organic molecule
Emp. Form.:
C23H27ClFNO
Mol. Mass.:
387.918
SMILES:
OC1(C[C@@H]2CC[C@H](C1)N2CCCCc1ccc(F)cc1)c1ccc(Cl)cc1
: