Target
cGMP-inhibited 3',5'-cyclic phosphodiesterase 3A
Ligand
BDBM50363910
Substrate
Meas. Tech.
ChEMBL_802317 (CHEMBL1949475)
IC50
2850±n/a nM
Citation
 Ochiai, KTakita, SEiraku, TKojima, AIwase, KKishi, TFukuchi, KYasue, TAdams, DRAllcock, RWJiang, ZKohno, Y Phosphodiesterase inhibitors. Part 3: Design, synthesis and structure-activity relationships of dual PDE3/4-inhibitory fused bicyclic heteroaromatic-dihydropyridazinones with anti-inflammatory and bronchodilatory activity. Bioorg Med Chem 20:1644-58 (2012)  
Target
Name:
cGMP-inhibited 3',5'-cyclic phosphodiesterase 3A
Synonyms:
3',5'-cyclic phosphodiesterase Cyclic GMP-inhibited phosphodiesterase A PDE3A_HUMAN Phosphodiesterase 3 (PDE3) Phosphodiesterase 3A Phosphodiesterase 3A (PDE3A1) cGMP-inhibited 3',5'-cyclic phosphodiesterase A | cGMP-inhibited 3,5-cyclic phosphodiesterase A
Type:
Enzyme
Mol. Mass.:
124966.46
Organism:
Homo sapiens (Human)
Description:
Q14432
Residue:
1141
  
Inhibitor
Name:
BDBM50363910
Synonyms:
CHEMBL1946934
Type:
Small organic molecule
Emp. Form.:
C15H13F3N2O2S
Mol. Mass.:
342.336
SMILES:
COc1ccc(C2=NNC(=O)CC2C)c2cc(sc12)C(F)(F)F
: