Target
cAMP-specific 3',5'-cyclic phosphodiesterase 4B
Ligand
BDBM50363908
Substrate
Meas. Tech.
ChEMBL_802318 (CHEMBL1949476)
IC50
1520±n/a nM
Citation
 Ochiai, KTakita, SEiraku, TKojima, AIwase, KKishi, TFukuchi, KYasue, TAdams, DRAllcock, RWJiang, ZKohno, Y Phosphodiesterase inhibitors. Part 3: Design, synthesis and structure-activity relationships of dual PDE3/4-inhibitory fused bicyclic heteroaromatic-dihydropyridazinones with anti-inflammatory and bronchodilatory activity. Bioorg Med Chem 20:1644-58 (2012)  
Target
Name:
cAMP-specific 3',5'-cyclic phosphodiesterase 4B
Synonyms:
3',5'-cyclic phosphodiesterase Isoform PDE4B1 PDE4B PDE4B_HUMAN Phosphodiesterase 4B (PDE4B) Phosphodiesterase Type 4 (PDE4B)
Type:
Protein
Mol. Mass.:
83318.87
Organism:
Homo sapiens (Human)
Description:
Q07343
Residue:
736
  
Inhibitor
Name:
BDBM50363908
Synonyms:
CHEMBL1946932
Type:
Small organic molecule
Emp. Form.:
C14H12F3N3O3
Mol. Mass.:
327.2586
SMILES:
COc1ccc(C2=NNC(=O)CC2C)c2nc(oc12)C(F)(F)F
: