Target
Papain
Ligand
BDBM50364000
Substrate
Meas. Tech.
ChEMBL_804541 (CHEMBL1952734)
IC50
30000±n/a nM
Citation
 Bhattacharya, AKRana, KC Design, synthesis and biological evaluation of peptidyl-vinylaminophosphonates as novel cysteine protease inhibitors. Bioorg Med Chem 19:7129-35 (2011)  
Target
Name:
Papain
Synonyms:
Allergen=Car p 1 PPI | Papaya proteinase I
Type:
Enzyme
Mol. Mass.:
38923.01
Organism:
Carica papaya
Description:
Papain was purchased from Sigma, Germany.
Residue:
345
  
Inhibitor
Name:
BDBM50364000
Synonyms:
CHEMBL1950253
Type:
Small organic molecule
Emp. Form.:
C30H35N2O6P
Mol. Mass.:
550.5825
SMILES:
CCOP(=O)(CC=C(NC(=O)[C@H](Cc1ccccc1)NC(=O)OCc1ccccc1)c1ccccc1)OCC
: