Target
Acyl-CoA desaturase 1
Ligand
BDBM50364013
Substrate
Meas. Tech.
ChEMBL_804545 (CHEMBL1952738)
IC50
8±n/a nM
Citation
 Powell, DABlack, WCBleasby, KChan, CCDeschenes, DGagnon, MGordon, RGuay, JGuiral, SHafey, MJHuang, ZIsabel, ELeblanc, YStyhler, AXu, LJZhang, LOballa, RM Nicotinic acids: liver-targeted SCD inhibitors with preclinical anti-diabetic efficacy. Bioorg Med Chem Lett 21:7281-6 (2011)  
Target
Name:
Acyl-CoA desaturase 1
Synonyms:
ACOD1_RAT Scd Stearoyl-CoA desaturase 1 (SCD1)
Type:
Enzyme
Mol. Mass.:
41485.97
Organism:
Rattus norvegicus (Rat)
Description:
P07308
Residue:
358
  
Inhibitor
Name:
BDBM50364013
Synonyms:
CHEMBL1950401
Type:
Small organic molecule
Emp. Form.:
C21H18BrFN4O3
Mol. Mass.:
473.295
SMILES:
OC(=O)c1ccc(nc1)-c1ccc(nn1)N1CCC(CC1)Oc1cc(F)ccc1Br
: