Target
Glutamate receptor ionotropic, NMDA 1/2B
Ligand
BDBM50419775
Substrate
Meas. Tech.
ChEMBL_802334 (CHEMBL1954478)
Ki
220±n/a nM
Citation
 Irvine, MWCosta, BMDlaboga, DCulley, GRHulse, RScholefield, CLAtlason, PFang, GEaves, RMorley, RMayo-Martin, MBAmici, MBortolotto, ZADonaldson, LCollingridge, GLMolnár, EMonaghan, DTJane, DE Piperazine-2,3-dicarboxylic acid derivatives as dual antagonists of NMDA and GluK1-containing kainate receptors. J Med Chem 55:327-41 (2012)  
Target
Name:
Glutamate receptor ionotropic, NMDA 1/2B
Synonyms:
Glutamate NMDA receptor; Grin1/Grin2b | Glutamate [NMDA] receptor subunit epsilon 2/zeta 1
Type:
Mol. Mass.:
Description:
ASSAY_ID of EBI is 141026
Components:
This complex has 2 components.
Component 1
Name:
Glutamate receptor ionotropic, NMDA 2B
Synonyms:
GluN2B Grin2b NMDA receptor subunit N2B (GluN2B) NMDE2_RAT | NR2B
Type:
Protein
Mol. Mass.:
166077.66
Organism:
Rattus norvegicus (Rat)
Description:
Q00960
Residue:
1482
  
Component 2
Name:
Glutamate receptor ionotropic, NMDA 1
Synonyms:
Glutamate (NMDA) receptor subunit zeta 1 Glutamate-NMDA-Channel Glutamate-NMDA-Polyamine NMDA Nmdar1 | phencyclidine
Type:
Enzyme Catalytic Domain
Mol. Mass.:
105533.40
Organism:
RAT
Description:
P35439
Residue:
938
  
Inhibitor
Name:
BDBM50419775
Synonyms:
CHEMBL1950808
Type:
Small organic molecule
Emp. Form.:
C21H18N2O5
Mol. Mass.:
378.378
SMILES:
OC(=O)[C@@H]1NCCN([C@@H]1C(O)=O)C(=O)c1ccc2c(ccc3ccccc23)c1
: