Target
Cannabinoid receptor 1
Ligand
BDBM50364085
Substrate
Meas. Tech.
ChEMBL_803201 (CHEMBL1954912)
EC50
3630±n/a nM
Citation
 Gijsen, HJDe Cleyn, MASurkyn, MVan Lommen, GRVerbist, BMNijsen, MJMeert, TWauwe, JVAerssens, J 5-sulfonyl-benzimidazoles as selective CB2 agonists-part 2. Bioorg Med Chem Lett 22:547-52 (2011)  
Target
Name:
Cannabinoid receptor 1
Synonyms:
CANN6 CB-R CNR CNR1_HUMAN Cannabinoid receptor Cannabinoid receptor 1 (brain)
Type:
G Protein-Coupled Receptor (GPCR)
Mol. Mass.:
52868.96
Organism:
Homo sapiens (Human)
Description:
P21554
Residue:
472
  
Inhibitor
Name:
BDBM50364085
Synonyms:
CHEMBL1950832
Type:
Small organic molecule
Emp. Form.:
C25H33N3O5S
Mol. Mass.:
487.612
SMILES:
CC(C)(C)c1nc2cc(ccc2n1CC1CCOCC1)S(=O)(=O)c1ccnc(OCCCO)c1
: