Target
Cannabinoid receptor 1
Ligand
BDBM50364098
Substrate
Meas. Tech.
ChEMBL_803201 (CHEMBL1954912)
EC50
>10000±n/a nM
Citation
 Gijsen, HJDe Cleyn, MASurkyn, MVan Lommen, GRVerbist, BMNijsen, MJMeert, TWauwe, JVAerssens, J 5-sulfonyl-benzimidazoles as selective CB2 agonists-part 2. Bioorg Med Chem Lett 22:547-52 (2011)  
Target
Name:
Cannabinoid receptor 1
Synonyms:
CANN6 CB-R CNR CNR1_HUMAN Cannabinoid receptor Cannabinoid receptor 1 (brain)
Type:
G Protein-Coupled Receptor (GPCR)
Mol. Mass.:
52868.96
Organism:
Homo sapiens (Human)
Description:
P21554
Residue:
472
  
Inhibitor
Name:
BDBM50364098
Synonyms:
CHEMBL1950924
Type:
Small organic molecule
Emp. Form.:
C19H28N2O4S2
Mol. Mass.:
412.567
SMILES:
CCS(=O)(=O)c1ccc2n(CC3CCS(=O)(=O)CC3)c(nc2c1)C(C)(C)C
: