Target
Bromodomain-containing protein 4
Ligand
BDBM50364106
Substrate
Meas. Tech.
ChEMBL_803470 (CHEMBL1953108)
IC50
30000±n/a nM
Citation
 Chung, CWDean, AWWoolven, JMBamborough, P Fragment-based discovery of bromodomain inhibitors part 1: inhibitor binding modes and implications for lead discovery. J Med Chem 55:576-86 (2012)  
Target
Name:
Bromodomain-containing protein 4
Synonyms:
BRD4 Bromodomain-containing protein 4 (BRD4) Protein HUNK1
Type:
Protein
Mol. Mass.:
152264.84
Organism:
Homo sapiens (Human)
Description:
O60885
Residue:
1362
  
Inhibitor
Name:
BDBM50364106
Synonyms:
CHEMBL1950957
Type:
Small organic molecule
Emp. Form.:
C14H19N3O4S
Mol. Mass.:
325.383
SMILES:
CN1Cc2cc(ccc2N(C)C1=O)S(=O)(=O)N1CCOCC1
: