Target
Substance-P receptor
Ligand
BDBM50364190
Substrate
Meas. Tech.
ChEMBL_804013 (CHEMBL1954993)
IC50
0.020±n/a nM
Citation
 Shirai, JSugiyama, HMorimoto, SMaezaki, HYamamoto, YOkanishi, SKamo, IMatsumoto, SIshigami, KInatomi, NImanishi, AKawamoto, MTarui, NHashimoto, TIkeura, Y Novel 3-phenylpiperidine-4-carboxamides as highly potent and orally long-acting neurokinin-1 receptor antagonists with reduced CYP3A induction. Bioorg Med Chem 20:962-77 (2012)  
Target
Name:
Substance-P receptor
Synonyms:
NK-1 receptor NK1 Receptor NK1R_HUMAN Neurokinin-1 (NK-1) SPR TACR1 Tachykinin receptor 1 (NK1) | tachykinin
Type:
G Protein-Coupled Receptor (GPCR)
Mol. Mass.:
46254.43
Organism:
Homo sapiens (Human)
Description:
P25103
Residue:
407
  
Inhibitor
Name:
BDBM50364190
Synonyms:
CHEMBL1951810
Type:
Small organic molecule
Emp. Form.:
C25H24F7N3O3
Mol. Mass.:
547.4652
SMILES:
CN(Cc1cc(cc(c1)C(F)(F)F)C(F)(F)F)C(=O)[C@H]1CCN(C[C@@H]1c1ccc(F)cc1C)C(=O)C(N)=O
: