Target
Muscarinic acetylcholine receptor M2
Ligand
BDBM50364326
Substrate
Meas. Tech.
ChEMBL_804672 (CHEMBL1953194)
IC50
7900±n/a nM
Citation
 Tripathy, RMcHugh, RJBacon, ERSalvino, JMMorton, GCAimone, LDHuang, ZMathiasen, JRDiCamillo, AHuffman, MJMcKenna, BAKopec, KLu, LDQian, JAngeles, TSConnors, TSpais, CHolskin, BDuzic, ESchaffhauser, HRossé, GC Discovery of 7-arylsulfonyl-1,2,3,4, 4a,9a-hexahydro-benzo[4,5]furo[2,3-c]pyridines: identification of a potent and selective 5-HT6 receptor antagonist showing activity in rat social recognition test. Bioorg Med Chem Lett 22:1421-6 (2012)  
Target
Name:
Muscarinic acetylcholine receptor M2
Synonyms:
ACM2_HUMAN Cholinergic, muscarinic M2 Muscarinic acetylcholine receptor M2 and M5 | RecName: Full=Muscarinic acetylcholine receptor M2
Type:
GPCR
Mol. Mass.:
51730.61
Organism:
Homo sapiens (Human)
Description:
P08172
Residue:
466
  
Inhibitor
Name:
BDBM50364326
Synonyms:
CHEMBL1949930
Type:
Small organic molecule
Emp. Form.:
C21H25NO5S
Mol. Mass.:
403.492
SMILES:
COc1cc(OC(C)C)cc(c1)S(=O)(=O)c1ccc2[C@@H]3CCNC[C@@H]3Oc2c1
: