Target
Potassium voltage-gated channel subfamily H member 2
Ligand
BDBM50364326
Substrate
Meas. Tech.
ChEMBL_804664 (CHEMBL1953186)
IC50
3300±n/a nM
Citation
 Tripathy, RMcHugh, RJBacon, ERSalvino, JMMorton, GCAimone, LDHuang, ZMathiasen, JRDiCamillo, AHuffman, MJMcKenna, BAKopec, KLu, LDQian, JAngeles, TSConnors, TSpais, CHolskin, BDuzic, ESchaffhauser, HRossé, GC Discovery of 7-arylsulfonyl-1,2,3,4, 4a,9a-hexahydro-benzo[4,5]furo[2,3-c]pyridines: identification of a potent and selective 5-HT6 receptor antagonist showing activity in rat social recognition test. Bioorg Med Chem Lett 22:1421-6 (2012)  
Target
Name:
Potassium voltage-gated channel subfamily H member 2
Synonyms:
1,3-beta-glucan synthase component GLS2 ERG Eag-related protein 1 Ether-a-go-go-related gene (HERG) Ether-a-go-go-related gene potassium channel 1 Ether-a-go-go-related gene potassium channel 1 (hERG1) Ether-a-go-go-related protein 1 H-ERG KCNH2 Potassium voltage-gated channel subfamily H member 2 (hERG) Voltage-gated potassium channel subunit Kv11.1 hERG Potassium Channel 1 | putative potassium channel subunit
Type:
Multi-pass membrane protein
Mol. Mass.:
126672.65
Organism:
Homo sapiens (Human)
Description:
Q12809
Residue:
1159
  
Inhibitor
Name:
BDBM50364326
Synonyms:
CHEMBL1949930
Type:
Small organic molecule
Emp. Form.:
C21H25NO5S
Mol. Mass.:
403.492
SMILES:
COc1cc(OC(C)C)cc(c1)S(=O)(=O)c1ccc2[C@@H]3CCNC[C@@H]3Oc2c1
: