Target
Carbonic anhydrase 2
Ligand
BDBM36131
Substrate
Meas. Tech.
ChEMBL_804820 (CHEMBL1953639)
Ki
>200000000±n/a nM
Citation
 Ohradanova, AVullo, DPastorekova, SPastorek, JJackson, DJWörheide, GSupuran, CT Anion inhibition studies of ana-carbonic anhydrase from the living fossil Astrosclera willeyana. Bioorg Med Chem Lett 22:1314-6 (2012)  
Target
Name:
Carbonic anhydrase 2
Synonyms:
CA-II CAC Carbonate dehydratase II Carbonic anhydrase 2 (CA-II) Carbonic anhydrase C Carbonic anhydrase II (CA-II) Carbonic anhydrase II (hCA II) | Carbonic anhydrase isoenzyme II (hCA II)
Type:
Enzyme
Mol. Mass.:
29250.71
Organism:
Homo sapiens (Human)
Description:
P00918
Residue:
260
  
Inhibitor
Name:
BDBM36131
Synonyms:
perchlorate | sodium perchlorate
Type:
Guest
Emp. Form.:
ClO4
Mol. Mass.:
99.451
SMILES:
[O-][Cl](=O)(=O)=O
: