Target
Mitogen-activated protein kinase 14
Ligand
BDBM50364373
Substrate
Meas. Tech.
ChEMBL_805033 (CHEMBL1952894)
IC50
860±n/a nM
Target
Name:
Mitogen-activated protein kinase 14
Synonyms:
CSAID-binding protein CSBP1 CSPB1 MAP kinase 14 MAP kinase p38 alpha MAPK14 MK14_HUMAN Mitogen-activated protein kinase p38 alpha Stress-activated protein kinase 2a | p38 MAP kinase alpha/beta
Type:
Serine/threonine-protein kinase
Mol. Mass.:
41286.76
Organism:
Homo sapiens (Human)
Description:
Q16539
Residue:
360
  
Inhibitor
Name:
BDBM50364373
Synonyms:
CHEMBL1950300
Type:
Small organic molecule
Emp. Form.:
C23H29F2N7O3S
Mol. Mass.:
521.583
SMILES:
CS(=O)(=O)N[C@H]1CC[C@@H](CC1)Nc1ncc2nc(Nc3ccc(F)cc3F)n(C3CCOCC3)c2n1
: