Target
Mitogen-activated protein kinase 8
Ligand
BDBM50364373
Substrate
Meas. Tech.
ChEMBL_805030 (CHEMBL1952891)
IC50
880±n/a nM
Target
Name:
Mitogen-activated protein kinase 8
Synonyms:
JNK-46 JNK1-alpha-1 MK08_HUMAN PRKM8 SAPK1C c-Jun N-terminal kinase 1 c-Jun N-terminal kinase 1(JNK1) | c-Jun N-terminal kinase 2 (JNK2)
Type:
Enzyme
Mol. Mass.:
48297.57
Organism:
Homo sapiens (Human)
Description:
JNK-1 was purchased from Upstate Cell Signaling Solutions (formerly Upstate Biotechnology).
Residue:
427
  
Inhibitor
Name:
BDBM50364373
Synonyms:
CHEMBL1950300
Type:
Small organic molecule
Emp. Form.:
C23H29F2N7O3S
Mol. Mass.:
521.583
SMILES:
CS(=O)(=O)N[C@H]1CC[C@@H](CC1)Nc1ncc2nc(Nc3ccc(F)cc3F)n(C3CCOCC3)c2n1
: