Target
Lysosomal Pro-X carboxypeptidase
Ligand
BDBM50364409
Substrate
Meas. Tech.
ChEMBL_805217 (CHEMBL1955695)
IC50
5000±n/a nM
Citation
 Wu, ZYang, CXiong, YFeng, ZLombardo, MVerras, AChabin, RMXu, STong, XXie, DLassman, MEBhatt, URGarcia-Calvo, MMGeissler, WShen, ZChen, QSinharoy, RHale, JJTata, JRPinto, SShen, DMColletti, SL Discovery of a new class of potent prolylcarboxypeptidase inhibitors derived from alanine. Bioorg Med Chem Lett 22:1774-8 (2012)  
Target
Name:
Lysosomal Pro-X carboxypeptidase
Synonyms:
PCP_MOUSE Proline carboxypeptidase | Prolylcarboxypeptidase
Type:
PROTEIN
Mol. Mass.:
55028.96
Organism:
Mus musculus
Description:
ChEMBL_1335505
Residue:
491
  
Inhibitor
Name:
BDBM50364409
Synonyms:
CHEMBL1950442
Type:
Small organic molecule
Emp. Form.:
C19H17Cl2N5O
Mol. Mass.:
402.277
SMILES:
C[C@H](NC(=O)[C@@H](N)Cc1cccc(c1)C#N)c1nc2cc(Cl)c(Cl)cc2[nH]1
: