Target
Baculoviral IAP repeat-containing protein 2
Ligand
BDBM50364501
Substrate
Meas. Tech.
ChEMBL_802616 (CHEMBL1952923)
EC50
279±n/a nM
Citation
 Hennessy, EJSaeh, JCSha, LMacIntyre, TWang, HLarsen, NAAquila, BMFerguson, ADLaing, NMOmer, CA Discovery of aminopiperidine-based Smac mimetics as IAP antagonists. Bioorg Med Chem Lett 22:1690-4 (2012)  
Target
Name:
Baculoviral IAP repeat-containing protein 2
Synonyms:
API1 BIRC2_HUMAN Cellular inhibitor of apoptosis 1 MIHB | RNF48
Type:
Protein
Mol. Mass.:
69900.47
Organism:
Homo sapiens (Human)
Description:
Q13490
Residue:
618
  
Inhibitor
Name:
BDBM50364501
Synonyms:
CHEMBL1950849
Type:
Small organic molecule
Emp. Form.:
C25H39FN4O2
Mol. Mass.:
446.6012
SMILES:
CN[C@@H](C)C(=O)N[C@@H](C1CCCCC1)C(=O)N[C@H]1CCCN(CCc2cccc(F)c2)C1
: