Target
Glucose-dependent insulinotropic receptor
Ligand
BDBM50364559
Substrate
Meas. Tech.
ChEMBL_802832 (CHEMBL1953650)
EC50
421±n/a nM
Citation
 Semple, GLehmann, JWong, ARen, ABruce, MShin, YJSage, CRMorgan, MChen, WCSebring, KChu, ZLLeonard, JNAl-Shamma, HGrottick, AJDu, FLiang, YDemarest, KJones, RM Discovery of a second generation agonist of the orphan G-protein coupled receptor GPR119 with an improved profile. Bioorg Med Chem Lett 22:1750-5 (2012)  
Target
Name:
Glucose-dependent insulinotropic receptor
Synonyms:
GP119_RAT | Gpr119
Type:
PROTEIN
Mol. Mass.:
51687.59
Organism:
Rattus norvegicus
Description:
ChEMBL_1506411
Residue:
468
  
Inhibitor
Name:
BDBM50364559
Synonyms:
CHEMBL1951032
Type:
Small organic molecule
Emp. Form.:
C21H29N5O6S
Mol. Mass.:
479.55
SMILES:
COc1c(Nc2ccc(nc2C)S(C)(=O)=O)ncnc1OC1CCN(CC1)C(=O)OC(C)C
: