Target
Glucose-dependent insulinotropic receptor
Ligand
BDBM50364542
Substrate
Meas. Tech.
ChEMBL_802831 (CHEMBL1953649)
EC50
34±n/a nM
Citation
 Semple, GLehmann, JWong, ARen, ABruce, MShin, YJSage, CRMorgan, MChen, WCSebring, KChu, ZLLeonard, JNAl-Shamma, HGrottick, AJDu, FLiang, YDemarest, KJones, RM Discovery of a second generation agonist of the orphan G-protein coupled receptor GPR119 with an improved profile. Bioorg Med Chem Lett 22:1750-5 (2012)  
Target
Name:
Glucose-dependent insulinotropic receptor
Synonyms:
G-protein coupled receptor 119 (GPR119) GPR119 | Glucose-dependent insulinotropic receptor
Type:
Protein
Mol. Mass.:
36901.49
Organism:
Homo sapiens (Human)
Description:
Q8TDV5
Residue:
335
  
Inhibitor
Name:
BDBM50364542
Synonyms:
CHEMBL1951012
Type:
Small organic molecule
Emp. Form.:
C21H27FN4O5S
Mol. Mass.:
466.526
SMILES:
CC(C)OC(=O)N1CCC(CC1)Oc1ncnc(Nc2ccc(cc2F)S(C)(=O)=O)c1C
: