Target
Sphingosine 1-phosphate receptor 1
Ligand
BDBM50364608
Substrate
Meas. Tech.
ChEMBL_802668 (CHEMBL1953076)
EC50
30±n/a nM
Citation
 Nakamura, TAsano, MSekiguchi, YMizuno, YTamaki, KKimura, TNara, FKawase, YShimozato, TDoi, HKagari, TTomisato, WInoue, RNagasaki, MYuita, HOguchi-Oshima, KKaneko, RWatanabe, NAbe, YNishi, T Discovery of CS-2100, a potent, orally active and S1P3-sparing S1P1 agonist. Bioorg Med Chem Lett 22:1788-92 (2012)  
Target
Name:
Sphingosine 1-phosphate receptor 1
Synonyms:
CHEDG1 Endothelial differentiation G-protein coupled receptor 1 S1P1 S1PR1_HUMAN Sphingosine 1-phosphate receptor Edg-1
Type:
Enzyme
Mol. Mass.:
42836.02
Organism:
Homo sapiens (Human)
Description:
P21453
Residue:
382
  
Inhibitor
Name:
BDBM50364608
Synonyms:
CHEMBL1951305
Type:
Small organic molecule
Emp. Form.:
C26H25N3O4S
Mol. Mass.:
475.559
SMILES:
CCCc1cc(CN2CC(C2)C(O)=O)sc1-c1noc(n1)-c1ccc(Oc2ccccc2)cc1
: