Target
Sphingosine 1-phosphate receptor 3
Ligand
BDBM50364623
Substrate
Meas. Tech.
ChEMBL_802669 (CHEMBL1953077)
EC50
6000±n/a nM
Citation
 Nakamura, TAsano, MSekiguchi, YMizuno, YTamaki, KKimura, TNara, FKawase, YShimozato, TDoi, HKagari, TTomisato, WInoue, RNagasaki, MYuita, HOguchi-Oshima, KKaneko, RWatanabe, NAbe, YNishi, T Discovery of CS-2100, a potent, orally active and S1P3-sparing S1P1 agonist. Bioorg Med Chem Lett 22:1788-92 (2012)  
Target
Name:
Sphingosine 1-phosphate receptor 3
Synonyms:
C9orf108 EDG3 S1P receptor 3 S1P3 S1PR3_HUMAN Sphingosine 1-phosphate receptor 3 (S1P3) | Sphingosine 1-phosphate receptor Edg-3
Type:
G Protein-Coupled Receptor (GPCR)
Mol. Mass.:
42278.13
Organism:
Homo sapiens (Human)
Description:
Q99500
Residue:
378
  
Inhibitor
Name:
BDBM50364623
Synonyms:
CHEMBL1951319
Type:
Small organic molecule
Emp. Form.:
C26H25N3O4S
Mol. Mass.:
475.559
SMILES:
CCc1cc(CN2CC(C2)C(O)=O)sc1-c1noc(n1)-c1ccc(Oc2ccccc2)c(C)c1
: