Target
Lysosomal Pro-X carboxypeptidase
Ligand
BDBM50364666
Substrate
Meas. Tech.
ChEMBL_802882 (CHEMBL1953700)
IC50
1±n/a nM
Citation
 Shen, HCDing, FXJiang, JVerras, AChabin, RMXu, STong, XChen, QXie, DLassman, MEBhatt, URGarcia-Calvo, MMGeissler, WShen, ZMurphy, BAGorski, JNWiltsie, JSinhaRoy, RHale, JJPinto, SShen, DM Discovery of benzodihydroisofurans as novel, potent, bioavailable and brain-penetrant prolylcarboxypeptidase inhibitors. Bioorg Med Chem Lett 22:1550-6 (2012)  
Target
Name:
Lysosomal Pro-X carboxypeptidase
Synonyms:
PCP_MOUSE Proline carboxypeptidase | Prolylcarboxypeptidase
Type:
PROTEIN
Mol. Mass.:
55028.96
Organism:
Mus musculus
Description:
ChEMBL_1335505
Residue:
491
  
Inhibitor
Name:
BDBM50364666
Synonyms:
CHEMBL1951456
Type:
Small organic molecule
Emp. Form.:
C26H22Cl2F3NO2
Mol. Mass.:
508.36
SMILES:
FC(F)(F)Oc1ccc(CN2CCC3(CC2)OC(c2ccccc32)c2cc(Cl)cc(Cl)c2)cc1
: