Target
Serine/threonine-protein kinase pim-1
Ligand
BDBM50364804
Substrate
Meas. Tech.
ChEMBL_803130 (CHEMBL1954566)
IC50
25±n/a nM
Citation
 Pastor, JOyarzabal, JSaluste, GAlvarez, RMRivero, VRamos, FCendón, EBlanco-Aparicio, CAjenjo, NCebriá, AAlbarrán, MICebrián, DCorrionero, AFominaya, JMontoya, GMazzorana, M Hit to lead evaluation of 1,2,3-triazolo[4,5-b]pyridines as PIM kinase inhibitors. Bioorg Med Chem Lett 22:1591-7 (2012)  
Target
Name:
Serine/threonine-protein kinase pim-1
Synonyms:
PIM-1 Kinase PIM1_HUMAN Serine/threonine-protein kinase (PIM1) Serine/threonine-protein kinase PIM1 | Serine/threonine-protein kinase pim-1 (PIM1)
Type:
Protein
Mol. Mass.:
35681.82
Organism:
Homo sapiens (Human)
Description:
P11309
Residue:
313
  
Inhibitor
Name:
BDBM50364804
Synonyms:
CHEMBL1952326
Type:
Small organic molecule
Emp. Form.:
C20H16F3N5O
Mol. Mass.:
399.3691
SMILES:
FC(F)(F)Oc1cccc(c1)-c1cnc2ccc(NCCc3cccnc3)nn12
: