Target
Serine/threonine-protein kinase pim-3
Ligand
BDBM50364774
Substrate
Meas. Tech.
ChEMBL_803132 (CHEMBL1954568)
IC50
28±n/a nM
Citation
 Pastor, JOyarzabal, JSaluste, GAlvarez, RMRivero, VRamos, FCendón, EBlanco-Aparicio, CAjenjo, NCebriá, AAlbarrán, MICebrián, DCorrionero, AFominaya, JMontoya, GMazzorana, M Hit to lead evaluation of 1,2,3-triazolo[4,5-b]pyridines as PIM kinase inhibitors. Bioorg Med Chem Lett 22:1591-7 (2012)  
Target
Name:
Serine/threonine-protein kinase pim-3
Synonyms:
PIM3 Serine/threonine-protein kinase pim-3 (PIM3)
Type:
Protein
Mol. Mass.:
35888.19
Organism:
Homo sapiens (Human)
Description:
Q86V86
Residue:
326
  
Inhibitor
Name:
BDBM50364774
Synonyms:
CHEMBL1952136
Type:
Small organic molecule
Emp. Form.:
C21H23F3N6
Mol. Mass.:
416.4427
SMILES:
FC(F)(F)c1cccc(c1)-n1nnc2ccc(NCC3CC4(C3)CCNCC4)nc12
: