Target
Serine/threonine-protein kinase pim-1
Ligand
BDBM50364818
Substrate
Meas. Tech.
ChEMBL_803130 (CHEMBL1954566)
IC50
238±n/a nM
Citation
 Pastor, JOyarzabal, JSaluste, GAlvarez, RMRivero, VRamos, FCendón, EBlanco-Aparicio, CAjenjo, NCebriá, AAlbarrán, MICebrián, DCorrionero, AFominaya, JMontoya, GMazzorana, M Hit to lead evaluation of 1,2,3-triazolo[4,5-b]pyridines as PIM kinase inhibitors. Bioorg Med Chem Lett 22:1591-7 (2012)  
Target
Name:
Serine/threonine-protein kinase pim-1
Synonyms:
PIM-1 Kinase PIM1_HUMAN Serine/threonine-protein kinase (PIM1) Serine/threonine-protein kinase PIM1 | Serine/threonine-protein kinase pim-1 (PIM1)
Type:
Protein
Mol. Mass.:
35681.82
Organism:
Homo sapiens (Human)
Description:
P11309
Residue:
313
  
Inhibitor
Name:
BDBM50364818
Synonyms:
CHEMBL1952118
Type:
Small organic molecule
Emp. Form.:
C21H25F3N6O2
Mol. Mass.:
450.4574
SMILES:
COCCN1CCC(CNc2ccc3nnn(-c4cccc(OC(F)(F)F)c4)c3n2)CC1
: