Target
Serine/threonine-protein kinase pim-1
Ligand
BDBM50364824
Substrate
Meas. Tech.
ChEMBL_803130 (CHEMBL1954566)
IC50
68±n/a nM
Citation
 Pastor, JOyarzabal, JSaluste, GAlvarez, RMRivero, VRamos, FCendón, EBlanco-Aparicio, CAjenjo, NCebriá, AAlbarrán, MICebrián, DCorrionero, AFominaya, JMontoya, GMazzorana, M Hit to lead evaluation of 1,2,3-triazolo[4,5-b]pyridines as PIM kinase inhibitors. Bioorg Med Chem Lett 22:1591-7 (2012)  
Target
Name:
Serine/threonine-protein kinase pim-1
Synonyms:
PIM-1 Kinase PIM1_HUMAN Serine/threonine-protein kinase (PIM1) Serine/threonine-protein kinase PIM1 | Serine/threonine-protein kinase pim-1 (PIM1)
Type:
Protein
Mol. Mass.:
35681.82
Organism:
Homo sapiens (Human)
Description:
P11309
Residue:
313
  
Inhibitor
Name:
BDBM50364824
Synonyms:
CHEMBL1952127
Type:
Small organic molecule
Emp. Form.:
C20H21F3N6O
Mol. Mass.:
418.4155
SMILES:
FC(F)(F)Oc1cccc(c1)-n1nnc2ccc(nc12)N1CCC2(C1)CCNCC2
: