Target
Neuronal acetylcholine receptor subunit alpha-3/beta-2
Ligand
BDBM50364890
Substrate
Meas. Tech.
ChEMBL_803922 (CHEMBL1954609)
EC50
>10000±n/a nM
Citation
 Schrimpf, MRSippy, KBBriggs, CAAnderson, DJLi, TJi, JFrost, JMSurowy, CSBunnelle, WHGopalakrishnan, MMeyer, MD SAR ofa7 nicotinic receptor agonists derived from tilorone: exploration of a novel nicotinic pharmacophore. Bioorg Med Chem Lett 22:1633-8 (2012)  
Target
Name:
Neuronal acetylcholine receptor subunit alpha-3/beta-2
Synonyms:
Neuronal acetylcholine receptor protein alpha-3/beta-2 subunit Neuronal acetylcholine receptor; alpha3/beta2
Type:
Mol. Mass.:
Description:
ASSAY_ID of EBI is 143246
Components:
This complex has 2 components.
Component 1
Name:
Neuronal acetylcholine receptor subunit beta-2
Synonyms:
ACHB2_HUMAN Neuronal acetylcholine receptor protein beta-2 subunit | Nicotinic acetylcholine receptor alpha3/beta2/alpha5
Type:
Protein
Mol. Mass.:
57020.50
Organism:
Homo sapiens (Human)
Description:
P17787
Residue:
502
  
Component 2
Name:
Neuronal acetylcholine receptor subunit alpha-3
Synonyms:
ACHA3_HUMAN Cholinergic, Nicotinic Alpha3Beta2 Cholinergic, Nicotinic Alpha3Beta4x NACHRA3 Neuronal acetylcholine receptor subunit alpha-3 nicotinic central
Type:
Enzyme Catalytic Domain
Mol. Mass.:
57479.03
Organism:
Homo sapiens (Human)
Description:
Cholinergic, Nicotinic Alpha3Beta2 0 HUMAN::P32297
Residue:
505
  
Inhibitor
Name:
BDBM50364890
Synonyms:
Amixin IC cid_5475
Type:
Small organic molecule
Emp. Form.:
C25H34N2O3
Mol. Mass.:
410.5491
SMILES:
CCN(CC)CCOc1ccc2-c3ccc(OCCN(CC)CC)cc3C(=O)c2c1
: