Target
Cytochrome P450 2D6
Ligand
BDBM50364958
Substrate
Meas. Tech.
ChEMBL_804470 (CHEMBL1952480)
IC50
>30000±n/a nM
Citation
 Hudkins, RLZulli, ALDandu, RrTao, MJosef, KAAimone, LDHaltiwanger, RCHuang, ZLyons, JAMathiasen, JRRaddatz, RGruner, JA 4-phenoxypiperidine pyridazin-3-one histamine H(3) receptor inverse agonists demonstrating potent and robust wake promoting activity. Bioorg Med Chem Lett 22:1504-9 (2012)  
Target
Name:
Cytochrome P450 2D6
Synonyms:
CP2D6_HUMAN CYP2DL1 Cytochrome P450 2D6 (CYP2D6) P450-DB1
Type:
Protein
Mol. Mass.:
55774.82
Organism:
Homo sapiens (Human)
Description:
P10635
Residue:
497
  
Inhibitor
Name:
BDBM50364958
Synonyms:
CHEMBL1950743
Type:
Small organic molecule
Emp. Form.:
C21H29N3O2
Mol. Mass.:
355.4739
SMILES:
CC1(C)CC(=NNC1=O)c1ccc(OC2CCN(CC2)C2CCC2)cc1
: