Target
Histamine H3 receptor
Ligand
BDBM50364963
Substrate
Meas. Tech.
ChEMBL_804458 (CHEMBL1952468)
Ki
46±n/a nM
Citation
 Hudkins, RLZulli, ALDandu, RrTao, MJosef, KAAimone, LDHaltiwanger, RCHuang, ZLyons, JAMathiasen, JRRaddatz, RGruner, JA 4-phenoxypiperidine pyridazin-3-one histamine H(3) receptor inverse agonists demonstrating potent and robust wake promoting activity. Bioorg Med Chem Lett 22:1504-9 (2012)  
Target
Name:
Histamine H3 receptor
Synonyms:
HH3R Hrh3
Type:
G Protein-Coupled Receptor (GPCR)
Mol. Mass.:
48607.98
Organism:
Rattus norvegicus (rat)
Description:
Residue:
445
  
Inhibitor
Name:
BDBM50364963
Synonyms:
CHEMBL1950646
Type:
Small organic molecule
Emp. Form.:
C19H25N3O2
Mol. Mass.:
327.4207
SMILES:
CC(C)N1CCC(CC1)Oc1ccc(cc1)-c1ccc(=O)n(C)n1
: