Target
Histamine H3 receptor
Ligand
BDBM50364971
Substrate
Meas. Tech.
ChEMBL_804457 (CHEMBL1952467)
Ki
5.9±n/a nM
Citation
 Hudkins, RLZulli, ALDandu, RrTao, MJosef, KAAimone, LDHaltiwanger, RCHuang, ZLyons, JAMathiasen, JRRaddatz, RGruner, JA 4-phenoxypiperidine pyridazin-3-one histamine H(3) receptor inverse agonists demonstrating potent and robust wake promoting activity. Bioorg Med Chem Lett 22:1504-9 (2012)  
Target
Name:
Histamine H3 receptor
Synonyms:
G-protein coupled receptor 97 HH3R HRH3 Histamine H3 receptor (H3) Histamine receptor (H3 and H4)
Type:
G Protein-Coupled Receptor (GPCR)
Mol. Mass.:
48691.47
Organism:
Homo sapiens (Human)
Description:
Binding assays were using CHO cells stably expressing hH3R receptors.
Residue:
445
  
Inhibitor
Name:
BDBM50364971
Synonyms:
CHEMBL1950739
Type:
Small organic molecule
Emp. Form.:
C20H26N4O2
Mol. Mass.:
354.446
SMILES:
Cn1nc(ccc1=O)-c1ccc(OC2CCN(CC2)C2CCCC2)nc1
: